WT-I-206
type: Class
comment: Water lines must pass the OGC_simple test
subclass of: Metric
expected data type: double

BYM-X-103
type: Class
comment: BoundaryMereing must be contained within the outline of a BoundaryArea of a certain type
subclass of: Metric
expected data type: double

WY-I-003
type: Class
comment: Way Form Function combination must be correct
subclass of: Metric
expected data type: double

WYG2-X-104b
type: Class
comment: WayGDF2 End must not intersect another WayGDF2 at a 2 node - exception for 'Virtual Junction' and 'Gate'
subclass of: Metric
expected data type: double

BYA-I-023
type: Class
comment: BoundaryArea irishName must be at least 3 characters long
subclass of: Metric
expected data type: double

BLDG-X-010
type: Class
comment: BuildingGroup must be referenced by at least 2 Buildings
subclass of: Metric
expected data type: double

RNS-I-210
type: Class
comment: RailNetworkSegment lines must not have Kickbacks
subclass of: Metric
expected data type: double

WT-I-007
type: Class
comment: Water lines must be at least 0.5m in length
subclass of: Metric
expected data type: double

ALL-I-003
type: Class
comment: IrishName metadata must be set if IrishName is not empty
subclass of: Metric
expected data type: double

ST-I-020
type: Class
comment: Site englishName must be at least 4 characters long
subclass of: Metric
expected data type: double

WYG2-I-206
type: Class
comment: WayGDF2 lines must pass the OGC_simple test
subclass of: Metric
expected data type: double

DIV-X-104
type: Class
comment: Division must not intersect another Division at a 2 node
subclass of: Metric
expected data type: double

BLD-I-209
type: Class
comment: Building polygons must not have Kickbacks
subclass of: Metric
expected data type: double

STR-X-121
type: Class
comment: Structure with this Form must intersect a Water polygon
subclass of: Metric
expected data type: double

EXP-X-125
type: Class
comment: Exposed 'Rock Face' must have Structure 'Top of Rock Face' on part of its boundary
subclass of: Metric
expected data type: double

WY-X-101
type: Class
comment: Way Roundabout lines must be have clockwise direction and a directionValue 'As Digitised'
subclass of: Metric
expected data type: double

VEG-I-211
type: Class
comment: Vegetation polygons must not have Spikes
subclass of: Metric
expected data type: double

BYL-X-102
type: Class
comment: BoundaryLine HWM must touch at least one other HWM BoundaryLine at its start
subclass of: Metric
expected data type: double

STR-X-133
type: Class
comment: Structure Rail Platform must be equal to Artificial with functionValue Concrete Gravel Tarred Artificial Area
subclass of: Metric
expected data type: double

WY-I-009
type: Class
comment: Way lineGeomValue must intersect its polygon boundary exactly twice
subclass of: Metric
expected data type: double

WY-X-104b
type: Class
comment: Way lineGeomValue End must not intersect another Way lineGeomValue at a 2 node - exception for 'Virtual Junction' and 'Gate'
subclass of: Metric
expected data type: double

LOC-I-025
type: Class
comment: Locale irishName must not start or end with a space
subclass of: Metric
expected data type: double

WY-I-015e
type: Class
comment: Way accessModeValue must be 'Restricted' for this Form and Function combination
subclass of: Metric
expected data type: double

WY-I-010
type: Class
comment: Way GDF2 reference must be set if specific Forms
subclass of: Metric
expected data type: double

STR-I-211
type: Class
comment: Structure geometries must not have Spikes
subclass of: Metric
expected data type: double

WTP-X-100
type: Class
comment: WaterPoint must connect to at least 1 Water or WaterSingleStream except if 'Spring'
subclass of: Metric
expected data type: double

RNS-X-104b
type: Class
comment: RailNetworkSegment End must not intersect another RailNetworkSegment at a 2 node
subclass of: Metric
expected data type: double

RP-X-110
type: Class
comment: RailPoints must not be within 1m of each other
subclass of: Metric
expected data type: double

BLD-I-023
type: Class
comment: Building irishName must be at least 4 characters long
subclass of: Metric
expected data type: double

ART-I-209
type: Class
comment: Artificial polygons must not have Kickbacks
subclass of: Metric
expected data type: double

STR-X-127
type: Class
comment: Structure 'Archway' must overlap Buildings
subclass of: Metric
expected data type: double

WY-X-107
type: Class
comment: Way must reference WayGDF2 with the same zOrderValue
subclass of: Metric
expected data type: double

WYG2-X-100a
type: Class
comment: WayGDF2 must connect to a WayPoint at its Start
subclass of: Metric
expected data type: double

VEG-I-006
type: Class
comment: Vegetation polygons must be at least 1 sq m in area
subclass of: Metric
expected data type: double

STR-I-024
type: Class
comment: Structure irishName must contain valid characters only
subclass of: Metric
expected data type: double

WSS-X-104a
type: Class
comment: WaterSingleStream Start must not intersect another WaterSingleStream at a 2 node
subclass of: Metric
expected data type: double

STR-I-205
type: Class
comment: Structure geometries must pass the OGC_simple test
subclass of: Metric
expected data type: double

BLP-I-209
type: Class
comment: BLP polygons must not have Kickbacks
subclass of: Metric
expected data type: double

EXP-I-209
type: Class
comment: Exposed polygons must not have Kickbacks
subclass of: Metric
expected data type: double

STP-I-003
type: Class
comment: Site point Form Function combination must be correct
subclass of: Metric
expected data type: double

LOC-I-020
type: Class
comment: Locale englishName must be at least 4 characters long
subclass of: Metric
expected data type: double

BYA-I-024
type: Class
comment: BoundaryArea irishName must contain valid characters only
subclass of: Metric
expected data type: double

BLDG-X-011
type: Class
comment: BuildingGroup geometry must be equal to the union of all Buildings that reference it
subclass of: Metric
expected data type: double

STR-X-110
type: Class
comment: Structure Points must not be within 0.4m of each other
subclass of: Metric
expected data type: double

ALL-I-004
type: Class
comment: IrishName metadata must not be set if IrishName is empty
subclass of: Metric
expected data type: double

ST-I-021
type: Class
comment: Site englishName must contain valid characters only
subclass of: Metric
expected data type: double

WT-I-008
type: Class
comment: Water must have lineGeomValue if Form in (River, Stream, Canal, Canal Lock, Mill Race)
subclass of: Metric
expected data type: double

DIV-X-105
type: Class
comment: Division lines must not overlap
subclass of: Metric
expected data type: double

DIV-I-006
type: Class
comment: Division lines must be at least 0.1m in length
subclass of: Metric
expected data type: double

STR-X-122
type: Class
comment: Structure 'Landform' must have 'Landform Line' around its edge
subclass of: Metric
expected data type: double

WY-I-209
type: Class
comment: Way polygons must not have Kickbacks
subclass of: Metric
expected data type: double

ST-I-003
type: Class
comment: Site Form Function combination must be correct
subclass of: Metric
expected data type: double

BLD-I-211
type: Class
comment: Building polygons must not have Spikes
subclass of: Metric
expected data type: double

BYL-X-103
type: Class
comment: BoundaryLine HWM must touch at least one other HWM BoundaryLine at its end
subclass of: Metric
expected data type: double

WY-I-210
type: Class
comment: Way lines must not have Kickbacks
subclass of: Metric
expected data type: double

Intrinsic
type: Class
subclass of: Category

WY-X-100a
type: Class
comment: Way with lineGeomValue must connect to a WayPoint at its Start
subclass of: Metric
expected data type: double

WYP-X-110
type: Class
comment: WayPoints must not be within 1m of each other
subclass of: Metric
expected data type: double

RNS-X-100a
type: Class
comment: RailNetworkSegment must connect to a RailPoint at its Start
subclass of: Metric
expected data type: double

WY-I-015f
type: Class
comment: Way accessModeValue must be 'Impossible' for this Form and Function combination
subclass of: Metric
expected data type: double

WY-I-011
type: Class
comment: Way GDF2 reference must NOT be set if specific Forms
subclass of: Metric
expected data type: double

WTP-X-101
type: Class
comment: WaterPoint 'Issue Point' must connect to the Start of exactly 1 Water or WaterSingleStream
subclass of: Metric
expected data type: double

RNS-I-006
type: Class
comment: RailNetworkSegment lines must be at least 0.5m in length
subclass of: Metric
expected data type: double

DIV-I-212
type: Class
comment: Division lines must not have Spikes
subclass of: Metric
expected data type: double

DIV-X-100
type: Class
comment: Division Open Wall must be contained within the boundary of exactly one Building
subclass of: Metric
expected data type: double

WT-I-015b
type: Class
comment: Water salinityValue must be 'Saltwater' for this Form
subclass of: Metric
expected data type: double

BLD-I-024
type: Class
comment: Building irishName must contain valid characters only
subclass of: Metric
expected data type: double

BYM-I-205
type: Class
comment: BoundaryMereing must pass the OGC_simple test
subclass of: Metric
expected data type: double

WYG2-I-003
type: Class
comment: WayGDF2 Form Function combination must be correct
subclass of: Metric
expected data type: double

STR-X-128
type: Class
comment: Structure 'Canopy' 'Building Overhang' must overlap Buildings
subclass of: Metric
expected data type: double

WY-X-108
type: Class
comment: Way must reference WayGDF2 with the same Form and Function
subclass of: Metric
expected data type: double

ART-I-211
type: Class
comment: Artificial polygons must not have Spikes
subclass of: Metric
expected data type: double

WSS-X-104b
type: Class
comment: WaterSingleStream End must not intersect another WaterSingleStream at a 2 node
subclass of: Metric
expected data type: double

RP-X-135
type: Class
comment: RailPoint Rail Switch must touch at least 3 RailNetworkSegment GDF1 lines
subclass of: Metric
expected data type: double

LOC-I-021
type: Class
comment: Locale englishName must contain valid characters only
subclass of: Metric
expected data type: double

LogicalConsistency
type: Class
subclass of: Dimension

WY-I-015a
type: Class
comment: Way accessModeValue must be 'Free' for this Form and Function combination
subclass of: Metric
expected data type: double

BLP-I-211
type: Class
comment: BLP polygons must not have Spikes
subclass of: Metric
expected data type: double

EXP-I-211
type: Class
comment: Exposed polygons must not have Spikes
subclass of: Metric
expected data type: double

RNS-I-212
type: Class
comment: RailNetworkSegment lines must not have Spikes
subclass of: Metric
expected data type: double

WT-I-009
type: Class
comment: Water lineGeomValue must intersect its polygon boundary exactly twice
subclass of: Metric
expected data type: double

ST-I-022
type: Class
comment: Site englishName must not start or end with a space
subclass of: Metric
expected data type: double

DIV-X-106
type: Class
comment: Division line Virtual Junction must be equal to the intersection of two Ways with the same Form Function
subclass of: Metric
expected data type: double

LOC-I-003
type: Class
comment: Locale Form Function combination must be correct
subclass of: Metric
expected data type: double

STR-X-123
type: Class
comment: Structure 'Landform Line' must be contained within a 'Landform' polygon
subclass of: Metric
expected data type: double

WT-X-104a
type: Class
comment: Water lineGeomValue Start must not intersect another Water lineGeomValue at a 2 node
subclass of: Metric
expected data type: double

BLD-I-031
type: Class
comment: Building must not have the same GeoId as another Building
subclass of: Metric
expected data type: double

BLD-X-100
type: Class
comment: Building must equal Artificial 'Built Environment' that it covers
comment: Building must equal Artificial 'Built Environment' that it covers (Old)
subclass of: Metric
expected data type: double

BYL-X-104
type: Class
comment: BoundaryLine LWM must touch exactly one other LWM BoundaryLine at its start
subclass of: Metric
expected data type: double

WY-I-211
type: Class
comment: Way polygons must not have Spikes
subclass of: Metric
expected data type: double

STR-I-020
type: Class
comment: Structure englishName must be at least 4 characters long
subclass of: Metric
expected data type: double

BYM-I-212
type: Class
comment: BoundaryMereing lines must not have Spikes
subclass of: Metric
expected data type: double

ART-I-006
type: Class
comment: Artificial polygons must be at least 1 sq m in area
subclass of: Metric
expected data type: double

WY-X-100b
type: Class
comment: Way with lineGeomValue must connect to a WayPoint at its End
subclass of: Metric
expected data type: double

STR-I-201
type: Class
comment: Structure polygons and closed lines must have at least 3 vertices
subclass of: Metric
expected data type: double

RNS-I-206
type: Class
comment: RailNetworkSegment lines must pass the OGC_simple test
subclass of: Metric
expected data type: double

RP-X-130
type: Class
comment: RailPoint must connect to at least 1 RailNetworkSegment
subclass of: Metric
expected data type: double

ThematicAccuracy
type: Class
subclass of: Dimension

RNS-X-100b
type: Class
comment: RailNetworkSegment must connect to a RailPoint at its End
subclass of: Metric
expected data type: double

WTP-X-102
type: Class
comment: WaterPoint 'Sink Point' must connect to the End of exactly 1 Water or WaterSingleStream
subclass of: Metric
expected data type: double

BLP-X-105
type: Class
comment: BLPs must not overlap
subclass of: Metric
expected data type: double

BLP-I-006
type: Class
comment: BLP polygons must be at least 10 sq m in area
subclass of: Metric
expected data type: double

EXP-I-006
type: Class
comment: Exposed polygons must be at least 1 sq m in area
subclass of: Metric
expected data type: double

ST-I-209
type: Class
comment: Site polygons must not have Kickbacks
subclass of: Metric
expected data type: double

WYG2-X-107
type: Class
comment: WayGDF2 must be referenced by Way with the same zOrderValue
subclass of: Metric
expected data type: double

DIV-X-101
type: Class
comment: Division other than InnerWall or OpenWall can only touch Building
subclass of: Metric
expected data type: double

BLD-I-025
type: Class
comment: Building irishName must not start or end with a space
subclass of: Metric
expected data type: double

BYM-I-206
type: Class
comment: BoundaryMereing must be at least 0.2m in length
subclass of: Metric
expected data type: double

WSS-I-210
type: Class
comment: WaterSingleStream lines must not have Kickbacks
subclass of: Metric
expected data type: double

WY-X-109
type: Class
comment: Way must reference WayGDF2 with the same Access Mode
subclass of: Metric
expected data type: double

WSS-X-100a
type: Class
comment: WaterSingleStream must connect to a WaterPoint at its Start
subclass of: Metric
expected data type: double

WT-I-209
type: Class
comment: Water polygons must not have Kickbacks
subclass of: Metric
expected data type: double

WY-I-006
type: Class
comment: Way polygons must be at least 1 sq m in area
subclass of: Metric
expected data type: double

LOC-I-022
type: Class
comment: Locale englishName must not start or end with a space
subclass of: Metric
expected data type: double

WT-I-210
type: Class
comment: Water lines must not have Kickbacks
subclass of: Metric
expected data type: double

PositionalAccuracy
type: Class
subclass of: Dimension

BYP-X-110
type: Class
comment: BoundaryPoints must not be within 1m of each other
subclass of: Metric
expected data type: double

BLD-I-020
type: Class
comment: Building englishName must be at least 4 characters long
subclass of: Metric
expected data type: double

SL-I-210
type: Class
comment: ServiceLine lines must not have Kickbacks
subclass of: Metric
expected data type: double

Representational
type: Class
subclass of: Category

WYG2-I-210
type: Class
comment: WayGDF2 lines must not have Kickbacks
subclass of: Metric
expected data type: double

STR-X-124
type: Class
comment: Structure 'Top of Rock Face' must be ring oriented along the boundary of an Exposed 'Rock Face' polygon
subclass of: Metric
expected data type: double

WT-X-104b
type: Class
comment: Water lineGeomValue End must not intersect another Water lineGeomValue at a 2 node
subclass of: Metric
expected data type: double

BLD-X-101
type: Class
comment: Building polygons must not overlap
subclass of: Metric
expected data type: double

BYL-X-105
type: Class
comment: BoundaryLine LWM must touch exactly one other LWM BoundaryLine at its end
subclass of: Metric
expected data type: double

STR-I-021
type: Class
comment: Structure englishName must contain valid characters only
subclass of: Metric
expected data type: double

BYM-X-101
type: Class
comment: BoundaryMereing cannot overlap
subclass of: Metric
expected data type: double

Completeness
type: Class
subclass of: Dimension

BYA-I-021
type: Class
comment: BoundaryArea englishName must contain valid characters only
subclass of: Metric
expected data type: double

Geospatial
type: Class
subclass of: Category

LOC-I-209
type: Class
comment: Locale polygons must not have Kickbacks
subclass of: Metric
expected data type: double

ALL-I-001
type: Class
comment: EnglishName metadata must be set if EnglishName is not empty
subclass of: Metric
expected data type: double

BLP-X-106
type: Class
comment: BLP must not overlap a Way feature with funcValue 'Main Road', 'First Class', 'Second Class', 'Third Class', 'Fourth Class' or 'Fifth Class' and zOrder=0
subclass of: Metric
expected data type: double

STR-I-003
type: Class
comment: Structure Form Function combination must be correct
subclass of: Metric
expected data type: double

RP-X-136a
type: Class
comment: RailPoint 'End of Rail' must connect to exactly 1 GDF1 RailNetworkSegment
subclass of: Metric
expected data type: double

WYG2-X-108
type: Class
comment: WayGDF2 must be referenced by Way with the same Form and Function
subclass of: Metric
expected data type: double

DIV-X-102
type: Class
comment: Division Inner Wall must be contained within 1 Building, or on the boundary between 2
subclass of: Metric
expected data type: double

BLD-I-026
type: Class
comment: Building bldNoValue must contain valid characters only
subclass of: Metric
expected data type: double

ST-I-211
type: Class
comment: Site polygons must not have Spikes
subclass of: Metric
expected data type: double

WYP-I-021
type: Class
comment: WayPoint englishName must contain valid characters only
subclass of: Metric
expected data type: double

WSS-X-100b
type: Class
comment: WaterSingleStream must connect to a WaterPoint at its End
subclass of: Metric
expected data type: double

BLD-I-008
type: Class
comment: Building must have a Point geometry
subclass of: Metric
expected data type: double

STR-X-131
type: Class
comment: Structure of this form must have Built Environment
subclass of: Metric
expected data type: double

BLDU-X-101
type: Class
comment: BuildingUnit point must be contained within a Building polygon
subclass of: Metric
expected data type: double

STR-X-101
type: Class
comment: Structure must not overlap other Structures of the same Form and Function
subclass of: Metric
expected data type: double

LOC-I-023
type: Class
comment: Locale irishName must be at least 3 characters long
subclass of: Metric
expected data type: double

WT-I-211
type: Class
comment: Water polygons must not have Spikes
subclass of: Metric
expected data type: double

WY-I-015c
type: Class
comment: Way accessModeValue must be 'Free' 'Toll' or 'Public Service Vehicle Only' for this Form and Function combination
comment: Way accessModeValue must be 'Free' or 'Toll' for this Form and Function combination
subclass of: Metric
expected data type: double

ST-I-024
type: Class
comment: Site irishName must contain valid characters only
subclass of: Metric
expected data type: double

ALL-I-007
type: Class
comment: FunctionValue metadata must not be null
subclass of: Metric
expected data type: double

WYG2-X-103
type: Class
comment: WayGDF2 must be referenced by 1 to 5 Way features
subclass of: Metric
expected data type: double

BYP-X-111
type: Class
comment: BoundaryPoint must be on a BoundaryMereing
subclass of: Metric
expected data type: double

BLD-I-021
type: Class
comment: Building englishName must contain valid characters only
subclass of: Metric
expected data type: double

WT-X-100a
type: Class
comment: Water with lineGeomValue must connect to WaterPoint at its Start
subclass of: Metric
expected data type: double

ART-X-100
type: Class
comment: Artificial 'Built Environment' must have Building or Structure
subclass of: Metric
expected data type: double

WTP-X-110
type: Class
comment: WaterPoints must not be within 1m of each other
subclass of: Metric
expected data type: double

SOE-X-001
type: Class
comment: SoE must have no gaps or overlaps
subclass of: Metric
expected data type: double

STR-X-125
type: Class
comment: Structure 'Canopy' 'Building Overhang' must not overlap Built Environment
subclass of: Metric
expected data type: double

WYP-X-131
type: Class
comment: WayPoint must connect to at least 1 Way or WayGDF2
subclass of: Metric
expected data type: double

BLDU-I-026
type: Class
comment: BuildingUnit addrUnitNumber must contain valid characters only
subclass of: Metric
expected data type: double

WY-X-105
type: Class
comment: Way lineGeomValue must be contained within the WayGDF2 line it references
subclass of: Metric
expected data type: double

BLD-X-102
type: Class
comment: Building must not intersect Divisions other than InnerWall and OpenWall
subclass of: Metric
expected data type: double

BLD-I-003
type: Class
comment: Building Form Function combination must be correct
subclass of: Metric
expected data type: double

WSS-I-006
type: Class
comment: WaterSingleStream lines must be at least 0.5m in length
subclass of: Metric
expected data type: double

STR-I-022
type: Class
comment: Structure englishName must not start or end with a space
subclass of: Metric
expected data type: double

WYG2-X-104a
type: Class
comment: WayGDF2 Start must not intersect another WayGDF2 at a 2 node - exception for 'Virtual Junction' and 'Gate'
subclass of: Metric
expected data type: double

WT-I-006
type: Class
comment: Water polygons must be at least 1 sq m in area
subclass of: Metric
expected data type: double

ALL-I-002
type: Class
comment: EnglishName metadata must not be set if EnglishName is empty
subclass of: Metric
expected data type: double

BLP-X-107
type: Class
comment: BLP must not overlap a Water feature with formValue 'River', 'Stream', 'Lake', 'Sea', 'Stream' or 'Canal' and zOrder=0
subclass of: Metric
expected data type: double

STR-I-004
type: Class
comment: Structure Function must not be 'Not Defined'
subclass of: Metric
expected data type: double

STP-X-002
type: Class
comment: Site point must be contained within the Site it references
subclass of: Metric
expected data type: double

DIV-X-103
type: Class
comment: Divisions at same ZOrder must be split where they intersect
subclass of: Metric
expected data type: double

BLD-I-027
type: Class
comment: Building bldNoValue must not start or end with a space
subclass of: Metric
expected data type: double

VEG-I-209
type: Class
comment: Vegetation polygons must not have Kickbacks
subclass of: Metric
expected data type: double

STR-X-120
type: Class
comment: Structure 'Sluice Gate' must be contained within Water polygon
subclass of: Metric
expected data type: double

BYL-X-101
type: Class
comment: BoundaryLine of the same type cannot overlap
subclass of: Metric
expected data type: double

BLD-I-009
type: Class
comment: Building pntGeomValue must be contained within the polygon of the Building
subclass of: Metric
expected data type: double

STR-X-132
type: Class
comment: Structure Steps must be equal to 8th Class Way and Form must be equal to Walk General
subclass of: Metric
expected data type: double

STR-X-102
type: Class
comment: Structure 'Bridge Fixed' 'Multiple Use' must intersect some SoE at zOrder less than 0
subclass of: Metric
expected data type: double

WY-I-008
type: Class
comment: Way must have lineGeomValue if specific Form and Functions
subclass of: Metric
expected data type: double

STR-I-209
type: Class
comment: Structure geometries must not have Kickbacks
subclass of: Metric
expected data type: double

WY-X-104a
type: Class
comment: Way lineGeomValue Start must not intersect another Way lineGeomValue at a 2 node - exception for 'Virtual Junction' and 'Gate'
subclass of: Metric
expected data type: double

WY-I-220
type: Class
comment: Way with certain form and functions must have directionValue 'As Digitised'
subclass of: Metric
expected data type: double

DIV-I-210
type: Class
comment: Division lines must not have Kickbacks
subclass of: Metric
expected data type: double

RNS-X-104a
type: Class
comment: RailNetworkSegment Start must not intersect another RailNetworkSegment at a 2 node
subclass of: Metric
expected data type: double

BYA-I-210
type: Class
comment: BoundaryArea of certain types must have a BdyId and EnglishName
subclass of: Metric
expected data type: double

BLD-I-022
type: Class
comment: Building englishName must not start or end with a space
subclass of: Metric
expected data type: double

WT-X-100b
type: Class
comment: Water with lineGeomValue must connect a WaterPoint at its End
subclass of: Metric
expected data type: double

WSS-I-206
type: Class
comment: WaterSingleStream lines must pass the OGC_simple test
subclass of: Metric
expected data type: double

LOC-I-006
type: Class
comment: Locale polygons must be at least 1 sq m in area
subclass of: Metric
expected data type: double

STR-X-126
type: Class
comment: Structure 'Archway' must not overlap Built Environment
subclass of: Metric
expected data type: double